{"text_format":"1","workbook":"xlsx","n_sheets":12,"sheets":["Maestra","Firmas clasificaciòn","Prep. Clasificacion S","Clasificación","Firmas Principal","Prep. Principal S","Round Robin","Principal RR","Principal Sen.","Listado D","Prep. Principal D","Principal D"],"not_rendered":{"charts":0,"images":1,"macros":1,"external_links":2,"defined_names":14,"comments":4,"pivot_tables":0},"unopened":[],"bounds":{"document_bytes":16777216,"sheet_cells":100000,"rows_first":2000,"rows_last":500,"rows_between":2000,"halvings":0,"cell_chars":16384,"cell_head_chars":4096},"cells_cut":0,"cells_raw":0,"read":"whole","date_system":"1900"}

{"sheet":"Maestra","index":0,"n_rows":18,"n_cols":8,"rows_kept":18,"cut":false,"hidden":false,"merged":[[17,0,17,2],[17,4,17,5],[17,7,17,8],[9,0,9,2],[9,4,9,5],[9,7,9,8],[13,0,13,2],[13,4,13,5],[13,7,13,8]]}
[null,null,"HOJA MAESTRA"]
[]
["ESTA HOJA LLENA EL ENCABEZAMIENTO DE TODAS LAS OTRAS, NO LA BORRE NI LA ELIMINE"]
["EN TODO ESTE ARCHIVO, ESCRIBA SOLO EN LAS AREAS GRISES"]
["CUANDO LLENE LAS AREAS GRISES DE ESTA HOJA, GUARDE COMO (Nombre que quiera darle) "]
["Y CONTINUE CON SU TRABAJO EN LAS OTRAS HOJAS."]
[]
["TORNEO",null,null,null,"CLASE",null,null,"CATEGORIA"]
[]
["COPA CLUB EL RODEO",null,null,null,"GRADO 2",null,null,"18 MASCULINO"]
{"$rows_left_out":9}
{"sheet":"Firmas clasificaciòn","index":1,"n_rows":40,"n_cols":18,"rows_kept":40,"cut":false,"hidden":false,"merged":[]}
[null,null,null,null,"PLANILLA DE FIRMAS CUADRO DE CLASIFICACION",null,null,null,null,null,null,null,null,null,null,null,null,"X"]
[null,null,null,null,null,null,null,null,null,null,null,null,null,null,null,null,null,"Y"]
[]
["Torneo",null,null,{"$f":"Maestra!A10","v":"COPA CLUB EL RODEO"},"Clase",{"$f":"Maestra!E10","v":"GRADO 2"},"Categoría",null,{"$f":"Maestra!H10","v":"18 MASCULINO"}]
[]
["Sede",null,null,{"$f":"Maestra!A14","v":"CLUB EL RODEO"},"Ciudad",{"$f":"Maestra!E14","v":"MEDELLIN"},"Fecha",null,{"$f":"Maestra!H14","v":"MAYO 7 AL 11"}]
[]
["Supervisor FCT",null,null,{"$f":"Maestra!A18","v":"ESTEBAN JIMENEZ"}]
[]
["Línea","Codigo","Apellido y Nombre","Liga","Fecha de Nacimiento D/M/A","Rank. Entrada","Status","Rank. Actual","FIRMA",null,"Teléfono para contacto","Estado"]
{"$rows_left_out":31}
{"sheet":"Prep. Clasificacion S","index":2,"n_rows":26,"n_cols":9,"rows_kept":26,"cut":false,"hidden":false,"merged":[]}
[null,null,null,null,"LISTA DE PREPARACION"]
[null,null,null,null,"CUADRO CLASIFICACION SENCILLOS"]
[]
["Torneo",null,null,{"$f":"Maestra!A10","v":"COPA CLUB EL RODEO"},"Clase",{"$f":"Maestra!E10","v":"GRADO 2"},"Categoría",null,{"$f":"Maestra!H10","v":"18 MASCULINO"}]
[]
["Sede",null,null,{"$f":"Maestra!A14","v":"CLUB EL RODEO"},"Ciudad",{"$f":"Maestra!E14","v":"MEDELLIN"},"Fecha",null,{"$f":"Maestra!H14","v":"MAYO 7 AL 11"}]
[]
["Supervisor FCT",null,null,{"$f":"Maestra!A18","v":"ESTEBAN JIMENEZ"}]
[]
["Línea",null,"Apellido y Nombre","Liga","Fecha de Nacimiento D/M/A","Rank. Entrada","Status","Rank. Actual"]
{"$rows_left_out":17}
{"sheet":"Clasificación","index":3,"n_rows":79,"n_cols":18,"rows_kept":79,"cut":false,"hidden":false,"merged":[]}
[null,null,null,null,null,null,null,null,null,null,null,null,null,"SENC. CLASIFICACION"]
[null,null,null,null,null,null,null,null,null,null,null,null,null,"Categoria",null,{"$f":"Maestra!H10","v":"18 MASCULINO"}]
[null,null,null,null,null,null,null,null,null,null,null,null,null,"Torneo",null,{"$f":"Maestra!A10","v":"COPA CLUB EL RODEO"}]
[null,null,null,null,null,null,null,null,null,null,null,null,null,"Ciudad",null,{"$f":"Maestra!E14","v":"MEDELLIN"}]
[{"$f":"Maestra!E10","v":"GRADO 2"},null,null,null,null,null,null,null,null,null,null,null,null,"Fecha",null,{"$f":"Maestra!H14","v":"MAYO 7 AL 11"}]
[null,null,null,null,null,null,null,null,null,null,null,null,null,"Sede",null,{"$f":"Maestra!A15","v":0}]
[1,{"$f":"IF($D7=\"\",\"\",VLOOKUP($D7,'Prep. Clasificacion S'!$A$11:$K$100,8))","v":23},{"$f":"UPPER(IF($D7=\"\",\"\",VLOOKUP($D7,'Prep. Clasificacion S'!$A$11:$K$100,7)))","v":"DA"},1,{"$f":"UPPER(IF($D7=\"\",\"\",VLOOKUP($D7,'Prep. Clasificacion S'!A$11:K$110,3)))","v":"GONZALEZ DAVID"},null,null,{"$f":"UPPER(IF($D7=\"\",\"\",VLOOKUP($D7,'Prep. Clasificacion S'!$A$11:$K$100,4)))","v":"RIS"},null,null,null,null,null,"Sede",null,{"$f":"Maestra!A14","v":"CLUB EL RODEO"}]
[null,null,null,null,null,null,null,null,"A",{"$f":"IF(I8=\"a\",E7,IF(I8=\"b\",E9,\"\"))","v":"GONZALEZ DAVID"},null,null,null,{"$f":"IF(I8=\"a\",H7,IF(I8=\"b\",H9,\"\"))","v":"RIS"}]
[2,{"$f":"IF($D9=\"\",\"\",VLOOKUP($D9,'Firmas clasificaciòn'!$A$11:$K$40,8))","v":""},{"$f":"IF($D9=\"\",\"\",VLOOKUP($D9,'Firmas clasificaciòn'!$A$11:$K$40,7))","v":""},null,"BYE",null,null,{"$f":"IF($D9=\"\",\"\",VLOOKUP($D9,'Firmas clasificaciòn'!$A$11:$K$40,4))","v":""}]
[null,null,null,null,null,null,null,null,null,null,"a",{"$f":"IF(K10=\"a\",J8,IF(K10=\"b\",J12,\"\"))","v":"GONZALEZ DAVID"},null,null,{"$f":"IF(K10=\"a\",N8,IF(K10=\"b\",N12,\"\"))","v":"RIS"}]
{"$rows_left_out":70}
{"sheet":"Firmas Principal","index":4,"n_rows":40,"n_cols":18,"rows_kept":40,"cut":false,"hidden":false,"merged":[]}
[null,null,null,null,"PLANILLA DE FIRMAS CUADRO PRINCIPAL",null,null,null,null,null,null,null,null,null,null,null,null,"X"]
[null,null,null,null,null,null,null,null,null,null,null,null,null,null,null,null,null,"Y"]
[]
["Torneo",null,null,{"$f":"Maestra!A10","v":"COPA CLUB EL RODEO"},"Clase",{"$f":"Maestra!E10","v":"GRADO 2"},"Categoría",null,{"$f":"Maestra!H10","v":"18 MASCULINO"}]
[]
["Sede",null,null,{"$f":"Maestra!A14","v":"CLUB EL RODEO"},"Ciudad",{"$f":"Maestra!E14","v":"MEDELLIN"},"Fecha",null,{"$f":"Maestra!H14","v":"MAYO 7 AL 11"}]
[]
["Supervisor FCT",null,null,{"$f":"Maestra!A18","v":"ESTEBAN JIMENEZ"}]
[]
["Línea","Codigo","Apellido y Nombre","Liga","Fecha de Nacimiento D/M/A","Rank. Entrada","Status","Rank. Actual","FIRMA",null,"Teléfono para contacto","Estado"]
{"$rows_left_out":31}
{"sheet":"Prep. Principal S","index":5,"n_rows":34,"n_cols":9,"rows_kept":34,"cut":false,"hidden":false,"merged":[]}
[null,null,null,null,"LISTA DE PREPARACION"]
[null,null,null,null,"CUADRO PRINCIPAL SENCILLOS"]
[]
["Torneo",null,null,{"$f":"Maestra!A10","v":"COPA CLUB EL RODEO"},"Clase",{"$f":"Maestra!E10","v":"GRADO 2"},"Categoría",null,{"$f":"Maestra!H10","v":"18 MASCULINO"}]
[]
["Sede",null,null,{"$f":"Maestra!A14","v":"CLUB EL RODEO"},"Ciudad",{"$f":"Maestra!E14","v":"MEDELLIN"},"Fecha",null,{"$f":"Maestra!H14","v":"MAYO 7 AL 11"}]
[]
["Supervisor FCT",null,null,{"$f":"Maestra!A18","v":"ESTEBAN JIMENEZ"}]
[]
["Línea","Còdigo","Apellido y Nombre","Liga","Fecha de Nacimiento D/M/A","Rank. Entrada","Status","Rank. Actual"]
{"$rows_left_out":25}
{"sheet":"Round Robin","index":6,"n_rows":34,"n_cols":33,"rows_kept":34,"cut":false,"hidden":false,"merged":[]}
[null,null,null,null,null,null,null,null,null,null,null,null,null,null,null,null,null,null,null,null,null,"SENCILLOS CUADRO DE ROUND ROBIN"]
[null,null,null,null,null,null,null,null,null,null,null,null,null,null,null,null,null,null,null,null,null,null,null,null,null,null,null,null,"Torneo",null,null,{"$f":"Maestra!A10","v":"COPA CLUB EL RODEO"}]
[null,null,null,null,null,null,null,null,null,null,null,null,null,null,null,null,null,null,null,null,null,null,null,null,null,null,null,null,"Ciudad",null,null,{"$f":"Maestra!E14","v":"MEDELLIN"}]
[null,null,null,null,null,null,null,null,null,null,null,null,null,null,null,null,null,null,null,null,null,null,null,null,null,null,null,null,"Categoría",null,null,{"$f":"Maestra!H10","v":"18 MASCULINO"}]
[null,null,null,null,null,null,null,null,null,null,null,null,null,null,null,null,null,null,null,null,null,null,null,null,null,null,null,null,"Fecha",null,null,{"$f":"Maestra!H14","v":"MAYO 7 AL 11"}]
[null,null,null,null,null,null,null,null,null,null,null,null,null,null,null,null,null,null,null,null,null,null,null,null,null,null,null,null,"Sede",null,null,{"$f":"Maestra!A14","v":"CLUB EL RODEO"}]
[{"$f":"Maestra!E10","v":"GRADO 2"},null,null,null,null,null,null,null,null,null,null,null,null,null,null,null,null,null,null,null,null,null,null,null,null,null,null,null,"Supervisor FCT",null,null,{"$f":"Maestra!A18","v":"ESTEBAN JIMENEZ"}]
[]
["N°","Rank","NOMBRE",null,"Liga",null,null,null,1,null,null,null,null,null,2,null,null,null,null,null,3,null,null,null,null,null,4,null,null,"PUNTOS","% SETS","% GAMES","PUESTO"]
[1,{"$f":"UPPER(IF($D10=\"\",\"\",VLOOKUP($D10,'Prep. Principal S'!$A$11:$K$34,8)))","v":""},{"$f":"UPPER(IF($D10=\"\",\"\",VLOOKUP($D10,'Prep. Principal S'!$A$10:$J$34,3)))","v":""},null,{"$f":"UPPER(IF($D10=\"\",\"\",VLOOKUP($D10,'Prep. Principal S'!$A$10:$J$34,4)))","v":""},null,null,null,null,null,null,null,null,null,null,null,null,null,null,null,null,null,null,null,null,null,null,null,null,{"$f":"IF((IF(R10-S10>0,1,0)+IF(T10-U10>0,1,0)+IF(V10-W10>0,1,0))=2,1,0)+IF((IF(L10-M10>0,1,0)+IF(N10-O10>0,1,0)+IF(P10-Q10>0,1,0))=2,1,0)+IF((IF(X10-Y10>0,1,0)+IF(Z10-AA10>0,1,0)+IF(AB10-AC10>0,1,0))=2,1,0)","v":0},{"$f":"((IF(AND(R10>5,S10<7),1,0)+IF(AND(T10>5,U10<7),1,0)+IF(AND(V10>5,W10<7),1,0)+IF(AND(L10>5,M10<7),1,0)+IF(AND(N10>5,O10<7),1,0)+IF(AND(P10>5,Q10<7),1,0)+IF(AND(X10>5,Y10<7),1,0)+IF(AND(Z10>5,AA10<7),1,0)+IF(AND(AB10>5,AC10<7),1,0))/(COUNTIF(R10,\">=0\")+COUNTIF(T10,\">=0\")+COUNTIF(V10,\">=0\")+COUNTIF(X10,\">=0\")+COUNTIF(Z10,\">=0\")+COUNTIF(AB10,\">=0\")++COUNTIF(L10,\">=0\")+COUNTIF(N10,\">=0\")+COUNTIF(P10,\">=0\")))*100","v":{"$error":"#DIV/0!"}},{"$f":"((L10+N10+P10+R10+T10+V10+X10+Z10+AB10)/(L10+M10+N10+O10+P10+Q10+R10+S10+T10+U10+V10+W10+X10+Y10+Z10+AA10+AB10+AC10))*100","v":{"$error":"#DIV/0!"}}]
{"$rows_left_out":25}
{"sheet":"Principal RR","index":7,"n_rows":79,"n_cols":12,"rows_kept":79,"cut":false,"hidden":false,"merged":[]}
[null,null,null,null,null,null,null,null,"SENC. CUADRO PRINCIPAL"]
[null,null,null,null,null,null,null,null,"Categoria",null,{"$f":"Maestra!H10","v":"18 MASCULINO"}]
[null,null,null,null,null,null,null,null,"Torneo",null,{"$f":"Maestra!A10","v":"COPA CLUB EL RODEO"}]
[null,null,null,null,null,null,null,null,"Ciudad",null,{"$f":"Maestra!E14","v":"MEDELLIN"}]
[{"$f":"Maestra!E10","v":"GRADO 2"},null,null,null,null,null,null,null,"Fecha",null,{"$f":"Maestra!H14","v":"MAYO 7 AL 11"}]
[]
[null,null,"NOMBRE","LIGA",null,null,null,null,"Sede",null,{"$f":"Maestra!A14","v":"CLUB EL RODEO"}]
[]
[]
[]
{"$rows_left_out":70}
{"sheet":"Principal Sen.","index":8,"n_rows":79,"n_cols":16,"rows_kept":79,"cut":false,"hidden":false,"merged":[]}
[null,null,null,null,null,null,null,null,null,null,null,"SENC. CUADRO PRINCIPAL"]
[null,null,null,null,null,null,null,null,null,null,null,null,null,"Categoria",null,{"$f":"Maestra!H10","v":"18 MASCULINO"}]
[null,null,null,null,null,null,null,null,null,null,null,null,null,"Torneo",null,{"$f":"Maestra!A10","v":"COPA CLUB EL RODEO"}]
[null,null,null,null,null,null,null,null,null,null,null,null,null,"Ciudad",null,{"$f":"Maestra!E14","v":"MEDELLIN"}]
[{"$f":"Maestra!E10","v":"GRADO 2"},null,null,null,null,null,null,null,null,null,null,null,null,"Fecha",null,{"$f":"Maestra!H14","v":"MAYO 7 AL 11"}]
[null,null,null,null,null,null,null,null,null,null,null,null,null,"Sede",null,{"$f":"Maestra!A15","v":0}]
[1,{"$f":"IF($D7=\"\",\"\",VLOOKUP($D7,'Prep. Principal S'!$A$11:$J$34,8))","v":1},{"$f":"IF($D7=\"\",\"\",VLOOKUP($D7,'Prep. Principal S'!$A$11:$J$34,7))","v":"DA"},1,{"$f":"UPPER(IF($D7=\"\",\"\",VLOOKUP($D7,'Prep. Principal S'!$A$11:$J$34,3)))","v":"MONCADA ALEJANDRO"},null,null,{"$f":"IF($D7=\"\",\"\",VLOOKUP($D7,'Prep. Principal S'!$A$11:$J$34,4))","v":"ANT"},null,null,null,null,null,"Sede",null,{"$f":"Maestra!A14","v":"CLUB EL RODEO"}]
[null,null,null,null,null,null,null,null,"A",{"$f":"IF(I8=\"a\",E7,IF(I8=\"b\",E9,\"\"))","v":"MONCADA ALEJANDRO"}]
[2,null,null,null,"BYE"]
[null,null,null,null,null,null,null,null,null,null,null,{"$f":"IF(K10=\"a\",J8,IF(K10=\"b\",J12,\"\"))","v":""}]
{"$rows_left_out":70}
{"sheet":"Listado D","index":9,"n_rows":61,"n_cols":17,"rows_kept":61,"cut":false,"hidden":false,"merged":[]}
[null,null,null,null,"LISTA DE DOBLES"]
[]
[]
["Torneo",null,null,{"$f":"Maestra!A10","v":"COPA CLUB EL RODEO"},"Clase",null,{"$f":"Maestra!E10","v":"GRADO 2"},null,null,"Categoría",null,null,null,null,{"$f":"Maestra!H10","v":"18 MASCULINO"}]
[]
["Sede",null,null,{"$f":"Maestra!A14","v":"CLUB EL RODEO"},"Ciudad",null,{"$f":"Maestra!E14","v":"MEDELLIN"},null,null,"Fecha",null,null,null,null,{"$f":"Maestra!H14","v":"MAYO 7 AL 11"}]
[]
["Supervisor FCT",null,null,{"$f":"Maestra!A18","v":"ESTEBAN JIMENEZ"}]
[]
[null,null,null,"Jugador 1",null,null,null,null,null,"Jugador 2",null,null,null,null,null,"Equipo"]
{"$rows_left_out":52}
{"sheet":"Prep. Principal D","index":10,"n_rows":43,"n_cols":15,"rows_kept":43,"cut":false,"hidden":false,"merged":[]}
[null,null,null,"LISTA DE PREPARACION DE DOBLES CUADRO PRINCIPAL"]
[]
[]
["Torneo",null,{"$f":"Maestra!A10","v":"COPA CLUB EL RODEO"},"Clase",null,{"$f":"Maestra!E10","v":"GRADO 2"},null,"Categoría",null,null,{"$f":"Maestra!H10","v":"18 MASCULINO"}]
[]
["Sede",null,{"$f":"Maestra!A14","v":"CLUB EL RODEO"},"Ciudad",null,{"$f":"Maestra!E14","v":"MEDELLIN"},null,"Fecha",null,null,{"$f":"Maestra!H14","v":"MAYO 7 AL 11"}]
[]
["Supervisor FCT",null,{"$f":"Maestra!A18","v":"ESTEBAN JIMENEZ"}]
[]
[null,null,"Jugador 1",null,null,null,null,"Jugador 2",null,null,null,null,null,"Equipo"]
{"$rows_left_out":34}
{"sheet":"Principal D","index":11,"n_rows":87,"n_cols":16,"rows_kept":87,"cut":false,"hidden":false,"merged":[]}
[null,null,null,null,null,null,null,null,null,null,null,null,null,"DOBLES CUADRO PRINCIPAL"]
[null,null,null,null,null,null,null,null,null,null,null,null,null,"Categoria",null,{"$f":"Maestra!H10","v":"18 MASCULINO"}]
[null,null,null,null,null,null,null,null,null,null,null,null,null,"Torneo",null,{"$f":"Maestra!A10","v":"COPA CLUB EL RODEO"}]
[null,null,null,null,null,null,null,null,null,null,null,null,null,"Ciudad",null,{"$f":"Maestra!E14","v":"MEDELLIN"}]
[{"$f":"Maestra!E10","v":"GRADO 2"},null,null,null,null,null,null,null,null,null,null,null,null,"Fecha",null,{"$f":"Maestra!H14","v":"MAYO 7 AL 11"}]
[1,{"$f":"IF($D6=\"\",\"\",IF(VLOOKUP($D6,'Prep. Principal D'!$A$12:$U$27,16)=\"DA\",,VLOOKUP($D6,'Prep. Principal D'!$A$12:$U$27,15)))","v":""},{"$f":"IF($D6=\"\",\"\",VLOOKUP($D6,'Prep. Principal D'!$A$12:$U$27,13))","v":""},null,{"$f":"UPPER(IF($D6=\"\",\"\",VLOOKUP($D6,'Prep. Principal D'!$A$7:$U$27,2)))","v":""},null,null,{"$f":"IF($D6=\"\",\"\",VLOOKUP($D6,'Prep. Principal D'!$A$12:$U$27,3))","v":""},null,{"$f":"IF(I7=\"a\",E6,IF(I7=\"b\",E8,\"\"))","v":""},null,null,null,"Sede",null,{"$f":"Maestra!A14","v":"CLUB EL RODEO"}]
[null,null,null,null,{"$f":"UPPER(IF($D6=\"\",\"\",VLOOKUP($D6,'Prep. Principal D'!$A$7:$U$27,7)))","v":""},null,null,{"$f":"IF($D6=\"\",\"\",VLOOKUP($D6,'Prep. Principal D'!$A$12:$U$27,8))","v":""},null,{"$f":"IF(I7=\"a\",E7,IF(I7=\"b\",E9,\"\"))","v":""}]
[2,{"$f":"IF($D8=\"\",\"\",IF(VLOOKUP($D8,'Prep. Principal D'!$A$12:$U$27,16)=\"DA\",,VLOOKUP($D8,'Prep. Principal D'!$A$12:$U$27,15)))","v":""},{"$f":"IF($D8=\"\",\"\",VLOOKUP($D8,'Prep. Principal D'!$A$12:$U$27,13))","v":""},null,{"$f":"UPPER(IF($D8=\"\",\"\",VLOOKUP($D8,'Prep. Principal D'!$A$7:$U$27,2)))","v":""},null,null,{"$f":"IF($D8=\"\",\"\",VLOOKUP($D8,'Prep. Principal D'!$A$12:$U$27,3))","v":""},null,null,null,{"$f":"IF(K9=\"a\",J6,IF(K9=\"b\",J10,\"\"))","v":""}]
[null,null,null,null,{"$f":"UPPER(IF($D8=\"\",\"\",VLOOKUP($D8,'Prep. Principal D'!$A$7:$U$27,7)))","v":""},null,null,{"$f":"IF($D8=\"\",\"\",VLOOKUP($D8,'Prep. Principal D'!$A$12:$U$27,8))","v":""},null,null,null,{"$f":"IF(K9=\"a\",J7,IF(K9=\"b\",J11,\"\"))","v":""}]
[3,{"$f":"IF($D10=\"\",\"\",IF(VLOOKUP($D10,'Prep. Principal D'!$A$12:$U$27,16)=\"DA\",,VLOOKUP($D10,'Prep. Principal D'!$A$12:$U$27,15)))","v":""},{"$f":"IF($D10=\"\",\"\",VLOOKUP($D10,'Prep. Principal D'!$A$12:$U$27,13))","v":""},null,{"$f":"UPPER(IF($D10=\"\",\"\",VLOOKUP($D10,'Prep. Principal D'!$A$7:$U$27,2)))","v":""},null,null,{"$f":"IF($D10=\"\",\"\",VLOOKUP($D10,'Prep. Principal D'!$A$12:$U$27,3))","v":""},null,{"$f":"IF(I11=\"a\",E10,IF(I11=\"b\",E12,\"\"))","v":""}]
{"$rows_left_out":77}